Reaction Details
TargetG protein-coupled receptor kinase 5
LigandBDBM50173330
Substrate/Competitorn/a
Meas. Tech.Assays for Inhibition of GRKs
pH7±n/a
IC50>100000±n/a nM
Commentsextracted
Citation Larsen, SDHoman, KWaldschmidt, HTesmer, JJ G protein-coupled receptor kinase 2 inhibitors and methods for use of the same US Patent US10023564 Publication Date 7/17/2018
 
G protein-coupled receptor kinase 5
Name:G protein-coupled receptor kinase 5
Type:PROTEIN
Mol. Mass.:67798.93
Organism:Homo sapiens (Human)
Description:ChEMBL_1280627
Residue:590
BDBM50173330
NameBDBM50173330
Synonyms:CHEMBL3808657 | US10023564, Example 13
TypeSmall organic molecule
Emp. Form.C29H21F7N6O3
Mol. Mass.634.5043
SMILESCC1=C(C(NC(=O)N1)c1ccc(F)c(c1)C(=O)NCc1cc(cc(c1)C(F)(F)F)C(F)(F)F)C(=O)Nc1ccc2[nH]ncc2c1