Reaction Details
TargetRho-associated protein kinase 1
LigandBDBM50173328
Substrate/Competitorn/a
Meas. Tech.Assays for Inhibition of ROCK
IC50 290±n/a nM
Citation Larsen, SDHoman, KWaldschmidt, HTesmer, JJ G protein-coupled receptor kinase 2 inhibitors and methods for use of the same US Patent US10023564 Publication Date 7/17/2018
 
Rho-associated protein kinase 1
Name:Rho-associated protein kinase 1
Type:Serine/threonine-protein kinase
Mol. Mass.:158156.77
Organism:Homo sapiens (Human)
Description:Q13464
Residue:1354
BDBM50173328
NameBDBM50173328
Synonyms:CHEMBL3808918 | US10023564, Example 14
TypeSmall organic molecule
Emp. Form.C30H29FN6O3
Mol. Mass.540.5881
SMILESCC1=C(C(NC(=O)N1)c1ccc(F)c(c1)C(=O)NCCc1c(C)cccc1C)C(=O)Nc1ccc2[nH]ncc2c1