Reaction Details
TargetRho-associated protein kinase 1
LigandBDBM50173312
Substrate/Competitorn/a
Meas. Tech.Assays for Inhibition of ROCK
IC50 97.0±n/a nM
Citation Larsen, SDHoman, KWaldschmidt, HTesmer, JJ G protein-coupled receptor kinase 2 inhibitors and methods for use of the same US Patent US10023564 Publication Date 7/17/2018
 
Rho-associated protein kinase 1
Name:Rho-associated protein kinase 1
Type:Serine/threonine-protein kinase
Mol. Mass.:158156.77
Organism:Homo sapiens (Human)
Description:Q13464
Residue:1354
BDBM50173312
NameBDBM50173312
Synonyms:CHEMBL3810312 | US10023564, Example 18
TypeSmall organic molecule
Emp. Form.C28H25FN6O4
Mol. Mass.528.5343
SMILESCOc1cccc(CNC(=O)c2cc(ccc2F)C2NC(=O)NC(C)=C2C(=O)Nc2ccc3[nH]ncc3c2)c1