Reaction Details
TargetRho-associated protein kinase 1
LigandBDBM50173326
Substrate/Competitorn/a
Meas. Tech.Assays for Inhibition of ROCK
IC50 400±n/a nM
Citation Larsen, SDHoman, KWaldschmidt, HTesmer, JJ G protein-coupled receptor kinase 2 inhibitors and methods for use of the same US Patent US10023564 Publication Date 7/17/2018
 
Rho-associated protein kinase 1
Name:Rho-associated protein kinase 1
Type:Serine/threonine-protein kinase
Mol. Mass.:158156.77
Organism:Homo sapiens (Human)
Description:Q13464
Residue:1354
BDBM50173326
NameBDBM50173326
Synonyms:CHEMBL3809604 | US10023564, Example 29
TypeSmall organic molecule
Emp. Form.C30H23F7N6O3
Mol. Mass.648.5308
SMILESCC1=C(C(NC(=O)N1)c1ccc(F)c(CC(=O)NCc2c(cccc2C(F)(F)F)C(F)(F)F)c1)C(=O)Nc1ccc2[nH]ncc2c1