Reaction Details
TargetG protein-coupled receptor kinase 5
LigandBDBM50173324
Substrate/Competitorn/a
Meas. Tech.Assays for Inhibition of GRKs
pH7±n/a
IC50>100000±n/a nM
Commentsextracted
Citation Larsen, SDHoman, KWaldschmidt, HTesmer, JJ G protein-coupled receptor kinase 2 inhibitors and methods for use of the same US Patent US10023564 Publication Date 7/17/2018
 
G protein-coupled receptor kinase 5
Name:G protein-coupled receptor kinase 5
Type:PROTEIN
Mol. Mass.:67798.93
Organism:Homo sapiens (Human)
Description:ChEMBL_1280627
Residue:590
BDBM50173324
NameBDBM50173324
Synonyms:CHEMBL3809124 | US10023564, Example 30
TypeSmall organic molecule
Emp. Form.C30H29FN6O5
Mol. Mass.572.5869
SMILESCOc1cccc(OC)c1CNC(=O)Cc1cc(ccc1F)C1NC(=O)NC(C)=C1C(=O)Nc1ccc2[nH]ncc2c1