Reaction Details
TargetBeta-adrenergic receptor kinase 1
LigandBDBM284005
Substrate/Competitorn/a
Meas. Tech.Assays for Inhibition of GRKs
pH7±n/a
IC50 1500±n/a nM
Commentsextracted
Citation Larsen, SDHoman, KWaldschmidt, HTesmer, JJ G protein-coupled receptor kinase 2 inhibitors and methods for use of the same US Patent US10023564 Publication Date 7/17/2018
 
Beta-adrenergic receptor kinase 1
Name:Beta-adrenergic receptor kinase 1
Type:Enzyme
Mol. Mass.:79581.30
Organism:Homo sapiens (Human)
Description:P25098
Residue:689
BDBM284005
NameBDBM284005
Synonyms:E31 | US10023564, Example 31
TypeSmall organic molecule
Emp. Form.C27H29FN6O5
Mol. Mass.536.5548
SMILESCC1=C(C(NC(=O)N1)c1ccc(F)c(CC(=O)N2CCOC(CCO)C2)c1)C(=O)Nc1ccc2[nH]ncc2c1