Reaction Details
TargetRhodopsin kinase GRK1
LigandBDBM284006
Substrate/Competitorn/a
Meas. Tech.Assays for Inhibition of GRKs
pH7±n/a
IC50 21000±n/a nM
Commentsextracted
Citation Larsen, SDHoman, KWaldschmidt, HTesmer, JJ G protein-coupled receptor kinase 2 inhibitors and methods for use of the same US Patent US10023564 Publication Date 7/17/2018
 
Rhodopsin kinase GRK1
Name:Rhodopsin kinase GRK1
Type:PROTEIN
Mol. Mass.:63520.09
Organism:Homo sapiens (Human)
Description:ChEMBL_774378
Residue:563
BDBM284006
NameBDBM284006
Synonyms:E32 | US10023564, Example 32
TypeSmall organic molecule
Emp. Form.C28H27FN6O5
Mol. Mass.546.5496
SMILESCC1=C(C(NC(=O)N1)c1ccc(F)c(CC(=O)N(CCO)Cc2ccco2)c1)C(=O)Nc1ccc2[nH]ncc2c1