Reaction Details
TargetBeta-adrenergic receptor kinase 1
LigandBDBM284008
Substrate/Competitorn/a
Meas. Tech.Assays for Inhibition of GRKs
pH7±n/a
IC50 1200±n/a nM
Commentsextracted
Citation Larsen, SDHoman, KWaldschmidt, HTesmer, JJ G protein-coupled receptor kinase 2 inhibitors and methods for use of the same US Patent US10023564 Publication Date 7/17/2018
 
Beta-adrenergic receptor kinase 1
Name:Beta-adrenergic receptor kinase 1
Type:Enzyme
Mol. Mass.:79581.30
Organism:Homo sapiens (Human)
Description:P25098
Residue:689
BDBM284008
NameBDBM284008
Synonyms:E34 | US10023564, Example 34
TypeSmall organic molecule
Emp. Form.C27H27FN8O3
Mol. Mass.530.5535
SMILESCN(Cc1nc(C)c[nH]1)C(=O)Cc1cc(ccc1F)C1NC(=O)NC(C)=C1C(=O)Nc1ccc2[nH]ncc2c1