Reaction Details
TargetBeta-adrenergic receptor kinase 1
LigandBDBM284009
Substrate/Competitorn/a
Meas. Tech.Assays for Inhibition of GRKs
pH7±n/a
IC50 960±n/a nM
Commentsextracted
Citation Larsen, SDHoman, KWaldschmidt, HTesmer, JJ G protein-coupled receptor kinase 2 inhibitors and methods for use of the same US Patent US10023564 Publication Date 7/17/2018
 
Beta-adrenergic receptor kinase 1
Name:Beta-adrenergic receptor kinase 1
Type:Enzyme
Mol. Mass.:79581.30
Organism:Homo sapiens (Human)
Description:P25098
Residue:689
BDBM284009
NameBDBM284009
Synonyms:E35 | US10023564, Example 35
TypeSmall organic molecule
Emp. Form.C29H25FN6O4
Mol. Mass.540.545
SMILESCC1=C(C(NC(=O)N1)c1ccc(F)c(CC(=O)N(CC#C)Cc2ccco2)c1)C(=O)Nc1ccc2[nH]ncc2c1