Reaction Details
TargetD(3) dopamine receptor
LigandBDBM123854
Substrate/Competitorn/a
Meas. Tech.Binding Assay
Ki 0.65±n/a nM
Citation Newman, AHGrundt, PCyriac, GCLuedtke, RCao, J 4-phenylpiperazine derivatives with functionalized linkers as dopamine D3 receptor selective ligands and methods of use US Patent US8748608 Publication Date 6/10/2014
 
D(3) dopamine receptor
Name:D(3) dopamine receptor
Type:n/a
Mol. Mass.:44243.43
Organism:Homo sapiens (Human)
Description:n/a
Residue:400
BDBM123854
NameBDBM123854
Synonyms:US8748608, 47
TypeSmall organic molecule
Emp. Form.C24H28FN3O4
Mol. Mass.441.4952
SMILESCOc1ccccc1N1CCN(CC(O)CCNC(=O)c2cc3cc(F)ccc3o2)CC1