Reaction Details
TargetBeta-secretase 2
LigandBDBM123857
Substrate/Competitorn/a
Meas. Tech.Immunofluorescence Resonance Energy Transfer (FRET) Assay
pH4.5±n/a
IC50 24±n/a nM
Commentsextracted
Citation Gabellieri, EGuba, WHilpert, HMauser, HMayweg, AVRogers-Evans, MRombach, DThomas, AWoltering, TWostl, W 1,4-oxazepines as BACE1 and/or BACE2 inhibitors US Patent US8748418 Publication Date 6/10/2014
 
Beta-secretase 2
Name:Beta-secretase 2
Type:Protein
Mol. Mass.:56171.20
Organism:Homo sapiens (Human)
Description:Q9Y5Z0
Residue:518
BDBM123857
NameBDBM123857
Synonyms:US8748418, 1
TypeSmall organic molecule
Emp. Form.C20H21ClF2N4O
Mol. Mass.406.857
SMILESC[C@@]1(N=C(N)COC[C@@H]1F)c1cc(NC2CCc3cc(Cl)cnc23)ccc1F