Reaction Details
TargetBeta-secretase 2
LigandBDBM123862
Substrate/Competitorn/a
Meas. Tech.Immunofluorescence Resonance Energy Transfer (FRET) Assay
pH4.5±n/a
IC50 11±n/a nM
Commentsextracted
Citation Gabellieri, EGuba, WHilpert, HMauser, HMayweg, AVRogers-Evans, MRombach, DThomas, AWoltering, TWostl, W 1,4-oxazepines as BACE1 and/or BACE2 inhibitors US Patent US8748418 Publication Date 6/10/2014
 
Beta-secretase 2
Name:Beta-secretase 2
Type:Protein
Mol. Mass.:56171.20
Organism:Homo sapiens (Human)
Description:Q9Y5Z0
Residue:518
BDBM123862
NameBDBM123862
Synonyms:US8748418, 6
TypeSmall organic molecule
Emp. Form.C17H17ClF5N5O
Mol. Mass.437.795
SMILESC[C@@]1(N=C(N)COCC1(F)F)c1cc(NCc2nn(cc2Cl)C(F)F)ccc1F