Reaction Details
TargetBeta-secretase 2
LigandBDBM123869
Substrate/Competitorn/a
Meas. Tech.Immunofluorescence Resonance Energy Transfer (FRET) Assay
pH4.5±n/a
IC50 28±n/a nM
Commentsextracted
Citation Gabellieri, EGuba, WHilpert, HMauser, HMayweg, AVRogers-Evans, MRombach, DThomas, AWoltering, TWostl, W 1,4-oxazepines as BACE1 and/or BACE2 inhibitors US Patent US8748418 Publication Date 6/10/2014
 
Beta-secretase 2
Name:Beta-secretase 2
Type:Protein
Mol. Mass.:56171.20
Organism:Homo sapiens (Human)
Description:Q9Y5Z0
Residue:518
BDBM123869
NameBDBM123869
Synonyms:US8748418, 14
TypeSmall organic molecule
Emp. Form.C22H24ClF3N4O
Mol. Mass.452.9
SMILESCC1(C)OCC(N)=N[C@](C)(c2cc(NC3CCc4cc(Cl)cnc34)ccc2F)C1(F)F