Reaction Details
TargetIntegrin-linked protein kinase
LigandBDBM123935
Substrate/Competitorn/a
Meas. Tech.In Vitro Ezyme Assay
Temperature313.15±n/a K
IC50 300±n/a nM
Commentsextracted
Citation Zhang, ZDaynard, TSWang, SDu, XChopiuk, GBYan, JChen, JSviridov, SV Pyrazolylbenzothiazole derivatives and their use as therapeutic agents US Patent US8754233 Publication Date 6/17/2014
 
Integrin-linked protein kinase
Name:Integrin-linked protein kinase
Type:Protein
Mol. Mass.:51429.75
Organism:Homo sapiens (Human)
Description:Q13418
Residue:452
BDBM123935
NameBDBM123935
Synonyms:US8754233, 2-(3-Amino-5-methyl-1H-pyrazol-4-yl)-benzothiazole-6-carboxylic acid methyl ester
TypeSmall organic molecule
Emp. Form.C13H12N4O2S
Mol. Mass.288.325
SMILESCOC(=O)c1ccc2nc(sc2c1)-c1c(C)[nH]nc1N