Reaction Details
TargetIntegrin-linked protein kinase
LigandBDBM123951
Substrate/Competitorn/a
Meas. Tech.In Vitro Ezyme Assay
Temperature313.15±n/a K
IC50 10±n/a nM
Commentsextracted
Citation Zhang, ZDaynard, TSWang, SDu, XChopiuk, GBYan, JChen, JSviridov, SV Pyrazolylbenzothiazole derivatives and their use as therapeutic agents US Patent US8754233 Publication Date 6/17/2014
 
Integrin-linked protein kinase
Name:Integrin-linked protein kinase
Type:Protein
Mol. Mass.:51429.75
Organism:Homo sapiens (Human)
Description:Q13418
Residue:452
BDBM123951
NameBDBM123951
Synonyms:US8754233, 2-(5-Amino-3-methyl-1H-pyrazol-4-yl)-benzothiazole-6-sulfonic acid amide
TypeSmall organic molecule
Emp. Form.C11H11N5O2S2
Mol. Mass.309.367
SMILESCc1[nH]nc(N)c1-c1nc2ccc(cc2s1)S(N)(=O)=O