Reaction Details
TargetIntegrin-linked protein kinase
LigandBDBM124001
Substrate/Competitorn/a
Meas. Tech.In Vitro Ezyme Assay
Temperature313.15±n/a K
IC50 40±n/a nM
Commentsextracted
Citation Zhang, ZDaynard, TSWang, SDu, XChopiuk, GBYan, JChen, JSviridov, SV Pyrazolylbenzothiazole derivatives and their use as therapeutic agents US Patent US8754233 Publication Date 6/17/2014
 
Integrin-linked protein kinase
Name:Integrin-linked protein kinase
Type:Protein
Mol. Mass.:51429.75
Organism:Homo sapiens (Human)
Description:Q13418
Residue:452
BDBM124001
NameBDBM124001
Synonyms:US8754233, 4-(5-Fluoro-benzothiazol-2-yl)-5-methyl-2H-pyrazol-3-ylamine
TypeSmall organic molecule
Emp. Form.C11H9FN4S
Mol. Mass.248.279
SMILESCc1[nH]nc(N)c1-c1nc2cc(F)ccc2s1