Reaction Details
TargetIntegrin-linked protein kinase
LigandBDBM124021
Substrate/Competitorn/a
Meas. Tech.In Vitro Ezyme Assay
Temperature313.15±n/a K
IC50 200±n/a nM
Commentsextracted
Citation Zhang, ZDaynard, TSWang, SDu, XChopiuk, GBYan, JChen, JSviridov, SV Pyrazolylbenzothiazole derivatives and their use as therapeutic agents US Patent US8754233 Publication Date 6/17/2014
 
Integrin-linked protein kinase
Name:Integrin-linked protein kinase
Type:Protein
Mol. Mass.:51429.75
Organism:Homo sapiens (Human)
Description:Q13418
Residue:452
BDBM124021
NameBDBM124021
Synonyms:US8754233, 4-Benzothiazol-2-yl-5-(3-dimethylamino-propyl)-2H-pyrazol-3-ylamine
TypeSmall organic molecule
Emp. Form.C15H19N5S
Mol. Mass.301.41
SMILESCN(C)CCCc1[nH]nc(N)c1-c1nc2ccccc2s1