Reaction Details
TargetIntegrin-linked protein kinase
LigandBDBM124053
Substrate/Competitorn/a
Meas. Tech.In Vitro Ezyme Assay
Temperature313.15±n/a K
IC50 100±n/a nM
Commentsextracted
Citation Zhang, ZDaynard, TSWang, SDu, XChopiuk, GBYan, JChen, JSviridov, SV Pyrazolylbenzothiazole derivatives and their use as therapeutic agents US Patent US8754233 Publication Date 6/17/2014
 
Integrin-linked protein kinase
Name:Integrin-linked protein kinase
Type:Protein
Mol. Mass.:51429.75
Organism:Homo sapiens (Human)
Description:Q13418
Residue:452
BDBM124053
NameBDBM124053
Synonyms:US8754233, 5-(4-Amino-phenyl)-4-benzothiazol-2-yl-2H-pyrazol-3-ylamine
TypeSmall organic molecule
Emp. Form.C16H13N5S
Mol. Mass.307.373
SMILESNc1[nH]nc(c1-c1nc2ccccc2s1)-c1ccc(N)cc1