Reaction Details
TargetGenome polyprotein
LigandBDBM124110
Substrate/Competitorn/a
Meas. Tech.Enzymatic assay
pH7.5±n/a
Temperature303.15±n/a K
Ki 43±n/a nM
Commentsextracted
Citation Simmen, KADe Kock, HARabiosson, PJTahri, ANilsson, KMSamuelsson, BBRosenquist, AAAntonov, D Macrocyclic inhibitors of hepatitis C virus US Patent US8754105 Publication Date 6/17/2014
 
Genome polyprotein
Name:Genome polyprotein
Synonyms:NS3/4A protein
Type:Enzyme
Mol. Mass.:73007.91
Organism:Hepatitis C virus
Description:B0B3F0
Residue:685
BDBM124110
NameBDBM124110
Synonyms:US8754105, 17
TypeSmall organic molecule
Emp. Form.C29H33ClN4O8S
Mol. Mass.633.112
SMILESCOc1ccc2c(O[C@@H]3C[C@@H]4N(C3)C(=O)OCCCC\C=C/[C@@H]3C[C@]3(NC4=O)C(=O)NS(=O)(=O)C3CC3)nc(Cl)cc2c1