Reaction Details
TargetGenome polyprotein
LigandBDBM124111
Substrate/Competitorn/a
Meas. Tech.Enzymatic assay
pH7.5±n/a
Temperature303.15±n/a K
Ki 40±n/a nM
Commentsextracted
Citation Simmen, KADe Kock, HARabiosson, PJTahri, ANilsson, KMSamuelsson, BBRosenquist, AAAntonov, D Macrocyclic inhibitors of hepatitis C virus US Patent US8754105 Publication Date 6/17/2014
 
Genome polyprotein
Name:Genome polyprotein
Synonyms:NS3/4A protein
Type:Enzyme
Mol. Mass.:73007.91
Organism:Hepatitis C virus
Description:B0B3F0
Residue:685
BDBM124111
NameBDBM124111
Synonyms:US8754105, 24
TypeSmall organic molecule
Emp. Form.C33H35N3O7
Mol. Mass.585.6469
SMILESCOc1ccc2c(O[C@@H]3C[C@@H]4N(C3)C(=O)OCCCCC\C=C/[C@@H]3C[C@]3(NC4=O)C(O)=O)cc(nc2c1)-c1ccccc1