Reaction Details
TargetHistone deacetylase 1
LigandBDBM124195
Substrate/Competitorn/a
Meas. Tech.Activity Assay
pH8±n/a
Temperature298.15±n/a K
IC50>30000±n/a nM
Commentsextracted
Citation Kozikowski, AButler, KVKalin, JH HDAC inhibitors and therapeutic methods of using same US Patent US8748451 Publication Date 6/10/2014
 
Histone deacetylase 1
Name:Histone deacetylase 1
Type:Enzyme
Mol. Mass.:55090.27
Organism:Homo sapiens (Human)
Description:Q13547
Residue:482
BDBM124195
NameBDBM124195
Synonyms:US8748451, 11
Typen/a
Emp. Form.C21H18N2O2
Mol. Mass.330.3798
SMILESONC(=O)Cc1ccc(Cn2c3ccccc3c3ccccc23)cc1