Reaction Details
TargetTyrosine-protein phosphatase non-receptor type 1
LigandBDBM124237
Substrate/Competitorn/a
Meas. Tech.pNPP assay
IC50 1.654e+4± 1.79e+3 nM
Citation Wang, WLHuang, CGao, LXTang, CLWang, JQWu, MCSheng, LChen, HJNan, FJLi, JYLi, JFeng, B Synthesis and biological evaluation of novel bis-aromatic amides as novel PTP1B inhibitors. Bioorg Med Chem Lett24:1889-94 (2014) 
 
Tyrosine-protein phosphatase non-receptor type 1
Name:Tyrosine-protein phosphatase non-receptor type 1
Type:Protein phosphatase
Mol. Mass.:49963.76
Organism:Homo sapiens (Human)
Description:Human recombinant GST-fusion PTP1B (1-435).
Residue:435
BDBM124237
NameBDBM124237
Synonyms:N,N'-([1,1'-biphenyl]-4,4'-diyl)bis(3-methylbutanamide) (8)
TypeSmall organic molecule
Emp. Form.C22H28N2O2
Mol. Mass.352.4699
SMILESCC(C)CC(=O)Nc1ccc(cc1)-c1ccc(NC(=O)CC(C)C)cc1