Reaction Details
TargetTyrosine-protein phosphatase non-receptor type 1
LigandBDBM124240
Substrate/Competitorn/a
Meas. Tech.pNPP assay
IC50 2.65e+3± 8e+1 nM
Citation Wang, WLHuang, CGao, LXTang, CLWang, JQWu, MCSheng, LChen, HJNan, FJLi, JYLi, JFeng, B Synthesis and biological evaluation of novel bis-aromatic amides as novel PTP1B inhibitors. Bioorg Med Chem Lett24:1889-94 (2014) 
 
Tyrosine-protein phosphatase non-receptor type 1
Name:Tyrosine-protein phosphatase non-receptor type 1
Type:Protein phosphatase
Mol. Mass.:49963.76
Organism:Homo sapiens (Human)
Description:Human recombinant GST-fusion PTP1B (1-435).
Residue:435
BDBM124240
NameBDBM124240
Synonyms:N,N'-(biphenyl-4,4'-diyl)bis(1-benzoylpiperidine-4-carboxamide) (14)
TypeSmall organic molecule
Emp. Form.C38H38N4O4
Mol. Mass.614.7327
SMILESO=C(Nc1ccc(cc1)-c1ccc(NC(=O)C2CCN(CC2)C(=O)c2ccccc2)cc1)C1CCN(CC1)C(=O)c1ccccc1