Reaction Details
TargetTyrosine-protein phosphatase non-receptor type 1
LigandBDBM124247
Substrate/Competitorn/a
Meas. Tech.pNPP assay
IC50 1.105e+4± 1.70e+3 nM
Citation Wang, WLHuang, CGao, LXTang, CLWang, JQWu, MCSheng, LChen, HJNan, FJLi, JYLi, JFeng, B Synthesis and biological evaluation of novel bis-aromatic amides as novel PTP1B inhibitors. Bioorg Med Chem Lett24:1889-94 (2014) 
 
Tyrosine-protein phosphatase non-receptor type 1
Name:Tyrosine-protein phosphatase non-receptor type 1
Type:Protein phosphatase
Mol. Mass.:49963.76
Organism:Homo sapiens (Human)
Description:Human recombinant GST-fusion PTP1B (1-435).
Residue:435
BDBM124247
NameBDBM124247
Synonyms:N-(6-(4-(furan-2-carboxamido)phenyl)pyridin-3-yl)furan-2-carboxamide (27)
TypeSmall organic molecule
Emp. Form.C21H15N3O4
Mol. Mass.373.3615
SMILESO=C(Nc1ccc(cc1)-c1ccc(NC(=O)c2ccco2)cn1)c1ccco1