Reaction Details
TargetTyrosine-protein phosphatase non-receptor type 6
LigandBDBM50391109
Substrate/Competitorn/a
Meas. Tech.pNPP assay
IC50 1.649e+4± 1.76e+3 nM
Citation Wang, WLHuang, CGao, LXTang, CLWang, JQWu, MCSheng, LChen, HJNan, FJLi, JYLi, JFeng, B Synthesis and biological evaluation of novel bis-aromatic amides as novel PTP1B inhibitors. Bioorg Med Chem Lett24:1889-94 (2014) 
 
Tyrosine-protein phosphatase non-receptor type 6
Name:Tyrosine-protein phosphatase non-receptor type 6
Type:Protein
Mol. Mass.:67570.41
Organism:Homo sapiens (Human)
Description:P29350
Residue:595
BDBM50391109
NameBDBM50391109
Synonyms:CHEMBL179166 Vanadates
TypeSmall organic molecule
Emp. Form.O4V
Mol. Mass.114.9407
SMILES[O-][V]([O-])([O-])=O