Reaction Details
TargetTyrosine-protein phosphatase non-receptor type 1
LigandBDBM124255
Substrate/Competitorn/a
IC50 2.7e+2± 2e+1 nM
Citation Yin, JPTang, CLGao, LXMa, WPLi, JYLi, YLi, JNan, FJ Design and synthesis of paracaseolide A analogues as selective protein tyrosine phosphatase 1B inhibitors. Org Biomol Chem12:3441-5 (2014) 
 
Tyrosine-protein phosphatase non-receptor type 1
Name:Tyrosine-protein phosphatase non-receptor type 1
Type:Protein phosphatase
Mol. Mass.:49963.76
Organism:Homo sapiens (Human)
Description:Human recombinant GST-fusion PTP1B (1-435).
Residue:435
BDBM124255
NameBDBM124255
Synonyms:(3S,3aR,4S,7R,7aS)-4-acetyl-7-dodecyl-3-methyl-1-oxo-7a-[(1E)-pentadec-1-en-1-yl]-1,3,3a,4,7,7a-hexahydro-2-benzofuran-5-carboxylic acid (9)
TypeSmall organic molecule
Emp. Form.C39H66O5
Mol. Mass.614.9383
SMILESCCCCCCCCCCCCC\C=C\[C@]12[C@H]([C@H](C)OC1=O)[C@H](C(C)=O)C(=C[C@H]2CCCCCCCCCCCC)C(O)=O