Reaction Details
TargetTyrosine-protein phosphatase non-receptor type 1
LigandBDBM124259
Substrate/Competitorn/a
IC50 2.04e+4± 2.47e+3 nM
Citation Yin, JPTang, CLGao, LXMa, WPLi, JYLi, YLi, JNan, FJ Design and synthesis of paracaseolide A analogues as selective protein tyrosine phosphatase 1B inhibitors. Org Biomol Chem12:3441-5 (2014) 
 
Tyrosine-protein phosphatase non-receptor type 1
Name:Tyrosine-protein phosphatase non-receptor type 1
Type:Protein phosphatase
Mol. Mass.:49963.76
Organism:Homo sapiens (Human)
Description:Human recombinant GST-fusion PTP1B (1-435).
Residue:435
BDBM124259
NameBDBM124259
Synonyms:(1R,6R,7S,10S,11R,12S)-6-dodecyl-7-(hydroxymethyl)-1,10-dimethyl-2,9,13-trioxatetracyclo[8.2.1.0⁴,.0⁷,]tridec-4-ene-3,8-dione (15)
TypeSmall organic molecule
Emp. Form.C25H38O6
Mol. Mass.434.5656
SMILESCCCCCCCCCCCC[C@@H]1C=C2[C@@H]3[C@H]4[C@](C)(OC(=O)[C@@]14CO)O[C@]3(C)OC2=O