Reaction Details
TargetTyrosine-protein phosphatase non-receptor type 2
LigandBDBM124258
Substrate/Competitorn/a
IC50 9.38e+3± 3.5e+2 nM
Citation Yin, JPTang, CLGao, LXMa, WPLi, JYLi, YLi, JNan, FJ Design and synthesis of paracaseolide A analogues as selective protein tyrosine phosphatase 1B inhibitors. Org Biomol Chem12:3441-5 (2014) 
 
Tyrosine-protein phosphatase non-receptor type 2
Name:Tyrosine-protein phosphatase non-receptor type 2
Type:Protein
Mol. Mass.:48481.80
Organism:Homo sapiens (Human)
Description:P17706
Residue:415
BDBM124258
NameBDBM124258
Synonyms:(1S,4S,5R,10R,11S,12R)-5-dodecyl-1,10-dimethyl-3,8-dioxo-2,9,13-trioxatetracyclo[8.2.1.0⁴,.0⁷,]tridec-6-ene-4-carbaldehyde (14)
TypeSmall organic molecule
Emp. Form.C25H36O6
Mol. Mass.432.5497
SMILESCCCCCCCCCCCC[C@@H]1C=C2[C@@H]3[C@H]4[C@](C)(OC(=O)[C@@]14C=O)O[C@]3(C)OC2=O