Reaction Details
TargetTyrosine-protein phosphatase non-receptor type 6
LigandBDBM124256
Substrate/Competitorn/a
IC50 4.41e+3± 5.8e+2 nM
Citation Yin, JPTang, CLGao, LXMa, WPLi, JYLi, YLi, JNan, FJ Design and synthesis of paracaseolide A analogues as selective protein tyrosine phosphatase 1B inhibitors. Org Biomol Chem12:3441-5 (2014) 
 
Tyrosine-protein phosphatase non-receptor type 6
Name:Tyrosine-protein phosphatase non-receptor type 6
Type:Protein
Mol. Mass.:67570.41
Organism:Homo sapiens (Human)
Description:P29350
Residue:595
BDBM124256
NameBDBM124256
Synonyms:(3S,3aR,4S,7aS)-4-acetyl-7-dodecyl-3-methyl-1-oxo-7a-[(1E)-pentadec-1-en-1-yl]-1,3,3a,4,7,7a-hexahydro-2-benzofuran-5-carboxylic acid (10)
TypeSmall organic molecule
Emp. Form.C39H66O5
Mol. Mass.614.9383
SMILESCCCCCCCCCCCCC\C=C\[C@]12[C@H]([C@H](C)OC1=O)[C@H](C(C)=O)C(=CC2CCCCCCCCCCCC)C(O)=O