Reaction Details
TargetM-phase inducer phosphatase 2
LigandBDBM124257
Substrate/Competitorn/a
IC50 2.34e+3±n/a nM
Citation Yin, JPTang, CLGao, LXMa, WPLi, JYLi, YLi, JNan, FJ Design and synthesis of paracaseolide A analogues as selective protein tyrosine phosphatase 1B inhibitors. Org Biomol Chem12:3441-5 (2014) 
 
M-phase inducer phosphatase 2
Name:M-phase inducer phosphatase 2
Type:Protein
Mol. Mass.:64985.27
Organism:Homo sapiens (Human)
Description:n/a
Residue:580
BDBM124257
NameBDBM124257
Synonyms:Paracaseolide A (13)
TypeSmall organic molecule
Emp. Form.C38H62O5
Mol. Mass.598.8959
SMILESCCCCCCCCCCCC\C=C\[C@@]12[C@H]3[C@H]4C(=C[C@H]1CCCCCCCCCCCC)C(=O)O[C@@]4(C)O[C@@]3(C)OC2=O