Reaction Details
TargetM-phase inducer phosphatase 2
LigandBDBM124259
Substrate/Competitorn/a
IC50 1.70e+4± 1.68e+3 nM
Citation Yin, JPTang, CLGao, LXMa, WPLi, JYLi, YLi, JNan, FJ Design and synthesis of paracaseolide A analogues as selective protein tyrosine phosphatase 1B inhibitors. Org Biomol Chem12:3441-5 (2014) 
 
M-phase inducer phosphatase 2
Name:M-phase inducer phosphatase 2
Type:Protein
Mol. Mass.:64985.27
Organism:Homo sapiens (Human)
Description:n/a
Residue:580
BDBM124259
NameBDBM124259
Synonyms:(1R,6R,7S,10S,11R,12S)-6-dodecyl-7-(hydroxymethyl)-1,10-dimethyl-2,9,13-trioxatetracyclo[8.2.1.0⁴,.0⁷,]tridec-4-ene-3,8-dione (15)
TypeSmall organic molecule
Emp. Form.C25H38O6
Mol. Mass.434.5656
SMILESCCCCCCCCCCCC[C@@H]1C=C2[C@@H]3[C@H]4[C@](C)(OC(=O)[C@@]14CO)O[C@]3(C)OC2=O