Reaction Details
TargetPhosphatidylinositol 4,5-bisphosphate 3-kinase catalytic subunit alpha isoform
LigandBDBM124736
Substrate/Competitorn/a
Meas. Tech.Alphascreen Assay
pH7±n/a
Ki 6.47±n/a nM
Commentsextracted
Citation Brown, MChen, YCushing, TDGonzalez Lopez De Turiso, FHe, XKohn, TJLohman, JWPattaropong, VSeganish, JShin, YSimard, JL Heterocyclic compounds and their uses US Patent US8765940 Publication Date 7/1/2014
 
Phosphatidylinositol 4,5-bisphosphate 3-kinase catalytic subunit alpha isoform
Name:Phosphatidylinositol 4,5-bisphosphate 3-kinase catalytic subunit alpha isoform
Type:Enzyme Subunit
Mol. Mass.:124294.87
Organism:Homo sapiens (Human)
Description:P42336
Residue:1068
BDBM124736
NameBDBM124736
Synonyms:US8765940, 4-(6-(3,6-dihydro-2H-pyran-4-yl)-3,3-dimethyl-2,3-dihydro-1H-pyrrolo[3,2-b]pyridin-1-yl)-7-fluoro-3-methyl-2-(2-pyridinyl)quinoline
TypeSmall organic molecule
Emp. Form.C29H27FN4O
Mol. Mass.466.5493
SMILESCc1c(nc2cc(F)ccc2c1N1CC(C)(C)c2ncc(cc12)C1=CCOCC1)-c1ccccn1