Reaction Details
TargetPhosphatidylinositol 4,5-bisphosphate 3-kinase catalytic subunit alpha isoform
LigandBDBM124762
Substrate/Competitorn/a
Meas. Tech.Alphascreen Assay
pH7±n/a
Ki 6.89±n/a nM
Commentsextracted
Citation Brown, MChen, YCushing, TDGonzalez Lopez De Turiso, FHe, XKohn, TJLohman, JWPattaropong, VSeganish, JShin, YSimard, JL Heterocyclic compounds and their uses US Patent US8765940 Publication Date 7/1/2014
 
Phosphatidylinositol 4,5-bisphosphate 3-kinase catalytic subunit alpha isoform
Name:Phosphatidylinositol 4,5-bisphosphate 3-kinase catalytic subunit alpha isoform
Type:Enzyme Subunit
Mol. Mass.:124294.87
Organism:Homo sapiens (Human)
Description:P42336
Residue:1068
BDBM124762
NameBDBM124762
Synonyms:US8765940, 1'-(5,7-difluoro-2-(2-methoxy-4-pyridinyl)-3-methyl-4-quinolinyl)-6'-(4-morpholinyl)-1',2,2',3,5,6-hexahydrospiro[pyran-4,3'-pyrrolo[3,2-b]pyridine]
TypeSmall organic molecule
Emp. Form.C31H31F2N5O3
Mol. Mass.559.6063
SMILESCOc1cc(ccn1)-c1nc2cc(F)cc(F)c2c(N2CC3(CCOCC3)c3ncc(cc23)N2CCOCC2)c1C