Reaction Details
TargetPhosphatidylinositol 4,5-bisphosphate 3-kinase catalytic subunit alpha isoform
LigandBDBM124764
Substrate/Competitorn/a
Meas. Tech.Alphascreen Assay
pH7±n/a
Ki 1.52±n/a nM
Commentsextracted
Citation Brown, MChen, YCushing, TDGonzalez Lopez De Turiso, FHe, XKohn, TJLohman, JWPattaropong, VSeganish, JShin, YSimard, JL Heterocyclic compounds and their uses US Patent US8765940 Publication Date 7/1/2014
 
Phosphatidylinositol 4,5-bisphosphate 3-kinase catalytic subunit alpha isoform
Name:Phosphatidylinositol 4,5-bisphosphate 3-kinase catalytic subunit alpha isoform
Type:Enzyme Subunit
Mol. Mass.:124294.87
Organism:Homo sapiens (Human)
Description:P42336
Residue:1068
BDBM124764
NameBDBM124764
Synonyms:US8765940, 2-(2,2-dimethyl-4-morpholinyl)-4-(3,3-dimethyl-6-(4-morpholinyl)-2,3-dihydro-1H-pyrrolo[3,2-b]pyridin-1-yl)-5,7-difluoro-3-methylquinoline
TypeSmall organic molecule
Emp. Form.C29H35F2N5O2
Mol. Mass.523.6173
SMILESCc1c(nc2cc(F)cc(F)c2c1N1CC(C)(C)c2ncc(cc12)N1CCOCC1)N1CCOC(C)(C)C1