Reaction Details
TargetPhosphatidylinositol 4,5-bisphosphate 3-kinase catalytic subunit alpha isoform
LigandBDBM124767
Substrate/Competitorn/a
Meas. Tech.Alphascreen Assay
pH7±n/a
Ki 1.96±n/a nM
Commentsextracted
Citation Brown, MChen, YCushing, TDGonzalez Lopez De Turiso, FHe, XKohn, TJLohman, JWPattaropong, VSeganish, JShin, YSimard, JL Heterocyclic compounds and their uses US Patent US8765940 Publication Date 7/1/2014
 
Phosphatidylinositol 4,5-bisphosphate 3-kinase catalytic subunit alpha isoform
Name:Phosphatidylinositol 4,5-bisphosphate 3-kinase catalytic subunit alpha isoform
Type:Enzyme Subunit
Mol. Mass.:124294.87
Organism:Homo sapiens (Human)
Description:P42336
Residue:1068
BDBM124767
NameBDBM124767
Synonyms:US8765940, 1-(7-fluoro-3-methyl-2-(4-methyl-2-pyridinyl)-4-quinolinyl)-7-(4-morpholinyl)-2,3-dihydro-1H-pyrido[2,3-b][1,4]thiazine 4,4-dioxide
TypeSmall organic molecule
Emp. Form.C27H26FN5O3S
Mol. Mass.519.59
SMILESCc1ccnc(c1)-c1nc2cc(F)ccc2c(N2CCS(=O)(=O)c3ncc(cc23)N2CCOCC2)c1C