Reaction Details
TargetPhosphatidylinositol 4,5-bisphosphate 3-kinase catalytic subunit alpha isoform
LigandBDBM124783
Substrate/Competitorn/a
Meas. Tech.Alphascreen Assay
pH7±n/a
Ki 2.3±n/a nM
Commentsextracted
Citation Brown, MChen, YCushing, TDGonzalez Lopez De Turiso, FHe, XKohn, TJLohman, JWPattaropong, VSeganish, JShin, YSimard, JL Heterocyclic compounds and their uses US Patent US8765940 Publication Date 7/1/2014
 
Phosphatidylinositol 4,5-bisphosphate 3-kinase catalytic subunit alpha isoform
Name:Phosphatidylinositol 4,5-bisphosphate 3-kinase catalytic subunit alpha isoform
Type:Enzyme Subunit
Mol. Mass.:124294.87
Organism:Homo sapiens (Human)
Description:P42336
Residue:1068
BDBM124783
NameBDBM124783
Synonyms:US8765940, 4-(3,3-dimethyl-6-(4-morpholinyl)-2,3-dihydro-1H-pyrrolo[3,2-b]pyridin-1-yl)-2-(3-fluorophenyl)-3-methyl-1,8-naphthyridine
TypeSmall organic molecule
Emp. Form.C28H28FN5O
Mol. Mass.469.5532
SMILESCc1c(nc2ncccc2c1N1CC(C)(C)c2ncc(cc12)N1CCOCC1)-c1cccc(F)c1