Reaction Details
TargetPhosphatidylinositol 4,5-bisphosphate 3-kinase catalytic subunit alpha isoform
LigandBDBM50396613
Substrate/Competitorn/a
Meas. Tech.Alphascreen Assay
pH7±n/a
Ki 7.75±n/a nM
Commentsextracted
Citation Brown, MChen, YCushing, TDGonzalez Lopez De Turiso, FHe, XKohn, TJLohman, JWPattaropong, VSeganish, JShin, YSimard, JL Heterocyclic compounds and their uses US Patent US8765940 Publication Date 7/1/2014
 
Phosphatidylinositol 4,5-bisphosphate 3-kinase catalytic subunit alpha isoform
Name:Phosphatidylinositol 4,5-bisphosphate 3-kinase catalytic subunit alpha isoform
Type:Enzyme Subunit
Mol. Mass.:124294.87
Organism:Homo sapiens (Human)
Description:P42336
Residue:1068
BDBM50396613
NameBDBM50396613
Synonyms:CHEMBL2171924 | US8765940, 1-(7-fluoro-3-methyl-2-(2-pyridinyl)-4-quinolinyl)-6-(4-morpholinyl)-1,2-dihydrospiro[indole-3,3'-thietane] 1',1'-dioxide
TypeSmall organic molecule
Emp. Form.C29H27FN4O3S
Mol. Mass.530.613
SMILESCc1c(nc2cc(F)ccc2c1N1CC2(CS(=O)(=O)C2)c2ccc(cc12)N1CCOCC1)-c1ccccn1