Reaction Details
TargetProstaglandin D2 receptor 2
LigandBDBM124835
Substrate/Competitorn/a
Meas. Tech.Radioligand Binding Assay
pH7.4±n/a
Temperature298.15±n/a K
Ki 0.2±n/a nM
Commentsextracted
Citation Anderskewitz, RMartyres, DOost, TRist, WSeither, P Pyrazole compounds as CRTH2 antagonists US Patent US8759386 Publication Date 6/24/2014
 
Prostaglandin D2 receptor 2
Name:Prostaglandin D2 receptor 2
Type:Enzyme
Mol. Mass.:43295.45
Organism:Homo sapiens (Human)
Description:Q9Y5Y4
Residue:395
BDBM124835
NameBDBM124835
Synonyms:US8759386, 32
TypeSmall organic molecule
Emp. Form.C25H24F2N4O3
Mol. Mass.466.4799
SMILESCCn1c(cc2cc(F)ccc12)C(=O)Nc1ccc(Cn2nc(C)c(CC(O)=O)c2C)c(F)c1