Reaction Details
TargetCholesteryl ester transfer protein
LigandBDBM124868
Substrate/Competitorn/a
Meas. Tech.In Vitro Assay
pH7.4±n/a
Temperature310.15±n/a K
IC50 41±n/a nM
Citation Mogi, MKawanami, TYamada, KYasoshima, KImase, HMiyake, TOhmori, O Organic compounds US Patent US8759365 Publication Date 6/24/2014
 
Cholesteryl ester transfer protein
Name:Cholesteryl ester transfer protein
Type:Enzyme
Mol. Mass.:54751.53
Organism:Homo sapiens (Human)
Description:P11597
Residue:493
BDBM124868
NameBDBM124868
Synonyms:US8759365, 9-1
TypeSmall organic molecule
Emp. Form.C29H34F6N6O2
Mol. Mass.612.6097
SMILESCCC(CC)OC(=O)N1C[C@H](C[C@H]1CC)N(Cc1cc(cc(c1)C(F)(F)F)C(F)(F)F)c1ncc(cn1)-c1cnn(C)c1