Reaction Details
TargetCholesteryl ester transfer protein
LigandBDBM124885
Substrate/Competitorn/a
Meas. Tech.In Vitro Assay
pH7.4±n/a
Temperature310.15±n/a K
IC50 110±n/a nM
Citation Mogi, MKawanami, TYamada, KYasoshima, KImase, HMiyake, TOhmori, O Organic compounds US Patent US8759365 Publication Date 6/24/2014
 
Cholesteryl ester transfer protein
Name:Cholesteryl ester transfer protein
Type:Enzyme
Mol. Mass.:54751.53
Organism:Homo sapiens (Human)
Description:P11597
Residue:493
BDBM124885
NameBDBM124885
Synonyms:US8759365, 23-6
TypeSmall organic molecule
Emp. Form.C32H37ClF6N8O2
Mol. Mass.715.132
SMILESCC[C@@H]1C[C@@H](CN1c1nc(ncc1Cl)N1CCC(O)CC1)N(Cc1cc(cc(c1)C(F)(F)F)C(F)(F)F)c1ncc(cn1)N1CCC(O)C1