Reaction Details
TargetPhosphatidylinositol 4,5-bisphosphate 3-kinase catalytic subunit delta isoform
LigandBDBM284821
Substrate/Competitorn/a
Meas. Tech.ADP-Glo Format PI3K Assays
pH7.5±n/a
Temperature298.15±n/a K
IC50 0.600±n/a nM
Commentsextracted
Citation Bhide, RSRuan, ZCherney, RJCornelius, LADhar, TGGong, HMarcoux, DPoss, MAQin, LShi, QTino, JA Heteroaryl substituted pyrrolotriazine amine compounds as PI3K inhibitors US Patent US10023576 Publication Date 7/17/2018
 
Phosphatidylinositol 4,5-bisphosphate 3-kinase catalytic subunit delta isoform
Name:Phosphatidylinositol 4,5-bisphosphate 3-kinase catalytic subunit delta isoform
Type:Enzyme Subunit
Mol. Mass.:119489.41
Organism:Homo sapiens (Human)
Description:O00329
Residue:1044
BDBM284821
NameBDBM284821
Synonyms:1-((cis)-4-(5-(4-amino-5-(1-(tetrahydro-2H-pyran-4-yl)-1H- pyrazol-5-yl)pyrrolo[2,1-f][1,2,4]triazin-7-yl)pyridin-3-yl)-3,5- dimethylpiperazin-1-yl)ethanone | US10023576, Example 11
TypeSmall organic molecule
Emp. Form.C27H33N9O2
Mol. Mass.515.61
SMILESC[C@H]1CN(C[C@@H](C)N1c1cncc(c1)-c1cc(-c2ccnn2C2CCOCC2)c2c(N)ncnn12)C(C)=O