Reaction Details
TargetPhosphatidylinositol 4,5-bisphosphate 3-kinase catalytic subunit delta isoform
LigandBDBM284871
Substrate/Competitorn/a
Meas. Tech.ADP-Glo Format PI3K Assays
pH7.5±n/a
Temperature298.15±n/a K
IC50 2.00±n/a nM
Commentsextracted
Citation Bhide, RSRuan, ZCherney, RJCornelius, LADhar, TGGong, HMarcoux, DPoss, MAQin, LShi, QTino, JA Heteroaryl substituted pyrrolotriazine amine compounds as PI3K inhibitors US Patent US10023576 Publication Date 7/17/2018
 
Phosphatidylinositol 4,5-bisphosphate 3-kinase catalytic subunit delta isoform
Name:Phosphatidylinositol 4,5-bisphosphate 3-kinase catalytic subunit delta isoform
Type:Enzyme Subunit
Mol. Mass.:119489.41
Organism:Homo sapiens (Human)
Description:O00329
Residue:1044
BDBM284871
NameBDBM284871
Synonyms:7-(2-(piperazin-1-yl)pyridin-4-yl)-5- (1-(tetrahydro-2H-pyran-4-yl)-1H- pyrazol-5-yl)pyrrolo[2,1-f][1,2,4] triazin-4-amine | US10023576, Example 62
TypeSmall organic molecule
Emp. Form.C23H27N9O
Mol. Mass.445.5202
SMILESNc1ncnn2c(cc(-c3ccnn3C3CCOCC3)c12)-c1ccnc(c1)N1CCNCC1