Reaction Details
TargetLysine-specific demethylase 5A
LigandBDBM50346863
Substrate/Competitorn/a
Meas. Tech.Biological Assay
pH7.5±n/a
Ki 61000±n/a nM
Commentsextracted
Citation Minucci, SMai, AMattevi, A Tranylcypromine derivatives as inhibitors of histone demethylases LSD1 and/or LSD2 US Patent US8765820 Publication Date 7/1/2014
 
Lysine-specific demethylase 5A
Name:Lysine-specific demethylase 5A
Type:Protein
Mol. Mass.:192210.15
Organism:Mus musculus (Mouse)
Description:Q3UXZ9
Residue:1690
BDBM50346863
NameBDBM50346863
Synonyms:CHEMBL1797640 | US8765820, 5b
TypeSmall organic molecule
Emp. Form.C16H16N2O
Mol. Mass.252.311
SMILESNC1CC1c1ccc(NC(=O)c2ccccc2)cc1