Reaction Details
TargetLysine-specific demethylase 5A
LigandBDBM50346864
Substrate/Competitorn/a
Meas. Tech.Biological Assay
pH7.5±n/a
Ki 20000±n/a nM
Commentsextracted
Citation Minucci, SMai, AMattevi, A Tranylcypromine derivatives as inhibitors of histone demethylases LSD1 and/or LSD2 US Patent US8765820 Publication Date 7/1/2014
 
Lysine-specific demethylase 5A
Name:Lysine-specific demethylase 5A
Type:Protein
Mol. Mass.:192210.15
Organism:Mus musculus (Mouse)
Description:Q3UXZ9
Residue:1690
BDBM50346864
NameBDBM50346864
Synonyms:CHEMBL1797641 US8765820, 8
TypeSmall organic molecule
Emp. Form.C26H27N3O3
Mol. Mass.429.5109
SMILESNC1CC1c1ccc(NC(=O)C(Cc2ccccc2)NC(=O)OCc2ccccc2)cc1