Reaction Details
TargetAmine oxidase [flavin-containing] A
LigandBDBM50346864
Substrate/Competitorn/a
Meas. Tech.Biological Assay
pH7.5±n/a
Ki 4000±n/a nM
Commentsextracted
Citation Minucci, SMai, AMattevi, A Tranylcypromine derivatives as inhibitors of histone demethylases LSD1 and/or LSD2 US Patent US8765820 Publication Date 7/1/2014
 
Amine oxidase [flavin-containing] A
Name:Amine oxidase [flavin-containing] A
Type:Protein
Mol. Mass.:59689.53
Organism:Homo sapiens (Human)
Description:P21397
Residue:527
BDBM50346864
NameBDBM50346864
Synonyms:CHEMBL1797641 US8765820, 8
TypeSmall organic molecule
Emp. Form.C26H27N3O3
Mol. Mass.429.5109
SMILESNC1CC1c1ccc(NC(=O)C(Cc2ccccc2)NC(=O)OCc2ccccc2)cc1