Reaction Details
TargetNeuronal acetylcholine receptor subunit alpha-7
LigandBDBM125051
Substrate/Competitorn/a
Meas. Tech.Inhibition Assay
pH7.4±n/a
Temperature277.15±n/a K
Ki 15±n/a nM
Citation Fleβner, TBöβ, FErb, CHafner, FSchnizler, KLang, DLuithle, JVan Kampen, MVan der Staay, F Azabicyclic carbamates and their use as alpha-7 nicotinic acetylcholine receptor agonists US Patent US8772511 Publication Date 7/8/2014
 
Neuronal acetylcholine receptor subunit alpha-7
Name:Neuronal acetylcholine receptor subunit alpha-7
Type:Enzyme
Mol. Mass.:56502.44
Organism:Rattus norvegicus (Rat)
Description:Q05941
Residue:502
BDBM125051
NameBDBM125051
Synonyms:US8772511, 16 | US9714242, 16
TypeSmall organic molecule
Emp. Form.C24H26N4O3S
Mol. Mass.450.553
SMILESCOc1cccc(NC(=O)Nc2ccc3cc(sc3c2)C(=O)N[C@H]2CN3CCC2CC3)c1