Reaction Details
TargetPhosphatidylinositol 4,5-bisphosphate 3-kinase catalytic subunit alpha isoform
LigandBDBM125320
Substrate/Competitorn/a
Meas. Tech.Alphascreen Assay
Ki 5±n/a nM
Citation Andrews, KLBo, YYBooker, SCee, VJD'Angelo, NHerberich, BJHong, FJackson, CLLanman, BALiao, HLiu, LNishimura, NNorman, MHPettus, LHReed, ABSmith, ALTadesse, STamayo, NAWu, BWurz, RYang, KC Inhibitors of PI3 kinase and/or mTOR US Patent US8772480 Publication Date 7/8/2014
 
Phosphatidylinositol 4,5-bisphosphate 3-kinase catalytic subunit alpha isoform
Name:Phosphatidylinositol 4,5-bisphosphate 3-kinase catalytic subunit alpha isoform
Type:Enzyme Subunit
Mol. Mass.:124294.87
Organism:Homo sapiens (Human)
Description:P42336
Residue:1068
BDBM125320
NameBDBM125320
Synonyms:US8772480, 139
TypeSmall organic molecule
Emp. Form.C25H23N7O4S
Mol. Mass.517.56
SMILESCOc1ccc(Nc2ncc(cc2-c2nc(C)nc3[nH]cnc23)C(O)c2ccc(cc2)S(C)(=O)=O)cn1