Reaction Details
TargetPhosphatidylinositol 4,5-bisphosphate 3-kinase catalytic subunit alpha isoform
LigandBDBM125440
Substrate/Competitorn/a
Meas. Tech.Alphascreen Assay
Ki 3±n/a nM
Citation Andrews, KLBo, YYBooker, SCee, VJD'Angelo, NHerberich, BJHong, FJackson, CLLanman, BALiao, HLiu, LNishimura, NNorman, MHPettus, LHReed, ABSmith, ALTadesse, STamayo, NAWu, BWurz, RYang, KC Inhibitors of PI3 kinase and/or mTOR US Patent US8772480 Publication Date 7/8/2014
 
Phosphatidylinositol 4,5-bisphosphate 3-kinase catalytic subunit alpha isoform
Name:Phosphatidylinositol 4,5-bisphosphate 3-kinase catalytic subunit alpha isoform
Type:Enzyme Subunit
Mol. Mass.:124294.87
Organism:Homo sapiens (Human)
Description:P42336
Residue:1068
BDBM125440
NameBDBM125440
Synonyms:US8772480, 295
TypeSmall organic molecule
Emp. Form.C25H30FN9O3S
Mol. Mass.555.628
SMILESCOc1ncc(Nc2ncc(cc2-c2nc(C)nc3[nH]cnc23)[C@@H](C)N2CCN(C[C@@H]2C)S(C)(=O)=O)cc1F