Reaction Details
TargetPhosphatidylinositol 4,5-bisphosphate 3-kinase catalytic subunit alpha isoform
LigandBDBM50396807
Substrate/Competitorn/a
Meas. Tech.Alphascreen Assay
Ki 2±n/a nM
Citation Andrews, KLBo, YYBooker, SCee, VJD'Angelo, NHerberich, BJHong, FJackson, CLLanman, BALiao, HLiu, LNishimura, NNorman, MHPettus, LHReed, ABSmith, ALTadesse, STamayo, NAWu, BWurz, RYang, KC Inhibitors of PI3 kinase and/or mTOR US Patent US8772480 Publication Date 7/8/2014
 
Phosphatidylinositol 4,5-bisphosphate 3-kinase catalytic subunit alpha isoform
Name:Phosphatidylinositol 4,5-bisphosphate 3-kinase catalytic subunit alpha isoform
Type:Enzyme Subunit
Mol. Mass.:124294.87
Organism:Homo sapiens (Human)
Description:P42336
Residue:1068
BDBM50396807
NameBDBM50396807
Synonyms:CHEMBL2170082 | US8772480, 316
TypeSmall organic molecule
Emp. Form.C22H28FN9O3S
Mol. Mass.517.58
SMILESCOc1ncc(Nc2ncc(CN3CCN(C[C@H]3C)S(C)(=O)=O)cc2-c2nc(C)nc(N)n2)cc1F