Reaction Details
TargetPhosphatidylinositol 4,5-bisphosphate 3-kinase catalytic subunit alpha isoform
LigandBDBM50401252
Substrate/Competitorn/a
Meas. Tech.Alphascreen Assay
Ki 4±n/a nM
Citation Andrews, KLBo, YYBooker, SCee, VJD'Angelo, NHerberich, BJHong, FJackson, CLLanman, BALiao, HLiu, LNishimura, NNorman, MHPettus, LHReed, ABSmith, ALTadesse, STamayo, NAWu, BWurz, RYang, KC Inhibitors of PI3 kinase and/or mTOR US Patent US8772480 Publication Date 7/8/2014
 
Phosphatidylinositol 4,5-bisphosphate 3-kinase catalytic subunit alpha isoform
Name:Phosphatidylinositol 4,5-bisphosphate 3-kinase catalytic subunit alpha isoform
Type:Enzyme Subunit
Mol. Mass.:124294.87
Organism:Homo sapiens (Human)
Description:P42336
Residue:1068
BDBM50401252
NameBDBM50401252
Synonyms:CHEMBL2206908 | US8772480, 332
TypeSmall organic molecule
Emp. Form.C20H24ClN9O3S
Mol. Mass.505.981
SMILESCc1nc(N)nc(n1)-c1cc(CN2CCOCC2)cnc1Nc1cnc(Cl)c(NS(C)(=O)=O)c1